{"text_format":"1","workbook":"xlsx","n_sheets":7,"sheets":["Útmutató","Rezsiszabály","Paraméterek","Mintasor","Mintalap","MintaÖsszSor","MintaÖsszes"],"not_rendered":{"charts":0,"images":2,"macros":1,"external_links":0,"defined_names":1,"comments":0,"pivot_tables":0},"unopened":[],"bounds":{"document_bytes":16777216,"sheet_cells":100000,"rows_first":2000,"rows_last":500,"rows_between":2000,"halvings":0,"cell_chars":16384,"cell_head_chars":4096},"cells_cut":0,"cells_raw":0,"read":"whole","date_system":"1900"}

{"sheet":"Útmutató","index":0,"n_rows":57,"n_cols":2,"rows_kept":57,"cut":false,"hidden":false,"merged":[[51,0,51,1],[0,0,0,1],[2,0,2,1],[6,0,6,1],[16,0,16,1],[23,0,23,1],[36,0,36,1],[43,0,43,1],[50,0,50,1]]}
["Saját bevételek rezsi nyilvántartási algoritmusa: alapadatok leírása"]
[]
["Rekord típus"]
[]
["A oszlop:","\"A\": szerződés azonosító rekord, a szerződés alapadatait tárolja\n\"T\": tervezett bevételi rekord, a szerződés egy adott időpontra tervezett bevételét rögzíti\n\"B\": bevételi rekord, a felette lévő \"T\" rekordban rögzített tervezett bevétel tényszerű megvalósulását rögzíti (Amennyiben egy tervezett bevétel több részletben érkezik be, ezek további \"B\" rekordokban rögzíthetők.)\n\"S\": szumma, szerződés összegző rekord, a beérkezett bevételek és tartozások összege az adott szerződésre\n\"M\": mindösszesen, az adott szervezeti egység összes szerződésének bevételi és tartozási összege"]
[]
["Szerződés azonosító adatok"]
[]
["B oszlop:","szerződés (pályázat vagy ipari megbízás) rövid neve"]
["C oszlop:","témavezető neve"]
{"$rows_left_out":48}
{"sheet":"Rezsiszabály","index":1,"n_rows":16,"n_cols":7,"rows_kept":16,"cut":false,"hidden":false,"merged":[[4,6,5,6],[2,0,2,6],[0,0,0,6],[4,3,4,5],[4,0,4,2]]}
["Rezsiszabály táblázat"]
[]
["Magyarázat\nÉrvényes: Az a költségvetési év, amelyben ez a szabály alkalmazandó (\"éééé\" alakban).\nTípus: 1 karakteres kód, értéke az A … Z (nagybetűk) közül választható, az adott költségvetési évben érvényes szabály típusa. \"A\" az alapértelmezés szerinti sajátbevételi szabály, \"B\" az alapértelmezés szerinti oktatási bevétel rezsi szabálya, a \"C\"...\"Z\" karakterek a kivételes kezelést igénylő esetek szabályai.\nKód: A rezsiszabályt azonosító 3 karakteres kód, \"Téé\" alakban. Automatikusan képződik a \"T\" típuskódból, és az érvényességi év utolsó két karakteréből.\nEgyetemi rezsi: Rezsiszorzó mérték (%). Minden bevételre fizetendő.\nKari rezsi: Rezsiszorzó mérték (%). Minden bevételre fizetendő.\nIntézeti rezsi: Rezsiszorzó mérték (%). Maximális érték. Az intézetnek átadandó.\n\nA rezsiszabály táblázat bővítése/rövidítése\nA táblázat a színezett sorokban tartalmazza a kitöltéséhez szükséges függvényeket. A táblázat tetszőleges számú sorral kiegészíthető egy színezett üres sor lemásolásával a táblázat alá. A táblázat sorai törölhetők is. Erre akkor lehet szükség, ha egy régi érvényességű szabályt már nem használunk a rezsielszámolásoknál. A törlés azért hasznos, mert a legördülő menük hosszát lerövidíti, ezáltal az áttekinthetőséget növeli. A rezsiszabályok sorrendje tetszőleges lehet. Amire figyelni kell: A rezsiszabályok között nem lehet üres sor!\n\nHibajelzések új szabály bevitelekor\n- Az érvényesség évének és a típusnak is kitöltöttnek kell lennie. Ellenkező esetben a kód értéke piros betűkkel világít.\n- Az új szabály kódja nem lehet azonos egyik korábbi kóddal sem. Az azonos kódok hátterei pirossá válnak. "]
[]
["Szabály azonosító",null,null,"Rezsiszorzó",null,null,"Leírás"]
["Érvényes","Típus","Kód","egyetemi","kari","intézeti"]
[2014,"A",{"$f":"B7&RIGHT(TEXT(A7,\"#\"),2)","v":"A14"},0.08,1.4999999999999999E-2,7.4999999999999997E-2,"Alapértelmezett szabály"]
[2014,"B",{"$f":"B8&RIGHT(TEXT(A8,\"#\"),2)","v":"B14"},0.14000000000000001,1.4999999999999999E-2,1.4999999999999999E-2,"Oktatási bevételek rezsije"]
[2013,"A","A13",0.1,7.0000000000000007E-2,0,"Tavalyi rezsiszabály"]
[2014,"C","C14",0.08,0,0,"ERC speciális szabály"]
{"$rows_left_out":7}
{"sheet":"Paraméterek","index":2,"n_rows":43,"n_cols":3,"rows_kept":43,"cut":false,"hidden":false,"merged":[[24,0,24,2],[23,0,23,2],[15,0,15,2],[0,0,0,2],[1,0,1,2],[2,0,2,2],[13,0,13,2],[14,0,14,2],[12,0,12,2]]}
["Kézi beállítású paraméterek"]
["Ezek a paraméterek szabályozzák a nyilvántartási algoritmus viselkedését. Értéküket a használat során a felhasználók megváltoztathatják. Leírásukat és felhasználásukat minden paraméternél megadjuk."]
[]
["Paraméter","Érték","Használati utasítás"]
["Dátumtartomány \n(könyvelési időszak) kezdete","2010-01-01","Adatbeviteli ellenőrzési célra használt érték, a hibás dátumok kiszűrésére. A nyilvántartási algoritmus megakadályozza minden olyan dátum bevitelét, amely ennél az értéknél korábbi. Érdemes a paraméter értékét minél nagyobbra választani, a nagyobb adatmegbízhatóság érdekében. Amennyiben ez az érték túlságosan nagynak bizonyulna, a későbbi felhasználás során a paraméter értéke megváltoztatható. Legkisebb megadható értéke 2000.01.01."]
["Dátumtartomány \n(könyvelési időszak) vége","2030-12-30","Adatbeviteli ellenőrzési célra használt érték, a hibás dátumok kiszűrésére. A nyilvántartási algoritmus megakadályozza minden olyan dátum bevitelét, amely ennél az értéknél későbbi. Érdemes a paraméter értékét minél kisebbre választani, a nagyobb adatmegbízhatóság érdekében. Amennyiben ez az érték túlságosan kicsinek bizonyulna, a későbbi felhasználás során a paraméter értéke megváltoztatható. A legnagyobb megadható érték nincs korlátozva."]
["Nyilvántartási időszak kezdete","2000-01-01","Kitöltött nyilvántartó munkalap esetén információs célokra használható. Tételezzük fel, hogy a kitöltés során bevittünk 2012-es, 2013-as és 2014-es kezdési idejű projekteket is. Ha kíváncsiak vagyunk arra, hogy mely szerződések indultak 2014-et megelőzően, akkor írjuk be ennek a paraméternek az értékére a 2014.01.01 dátumot. Menjünk át ezután a nyilvántartó munkalapra, ahol színezett háttérrel jelennek meg a projekteknek azok az indulási/befejezési dátumai, amelyek az itt megadott nyilvántartási időszakon kívül esnek. Tájékozódásunk után állítsuk vissza a \"Nyilvántartási időszak kezdete\" paramétert egy olyan a dátumra, amely az összes nyilvántartani kívánt projekt kezdési időpontja előtt van. A paraméter legkisebb megadható értéke 2000.01.01."]
["Nyilvántartási időszak vége","3000-01-01","Kitöltött nyilvántartó munkalap esetén információs célokra használható. Segítségével tájékozódhatunk arról, hogy mely projektek induló/záró dátuma nem esik az itt megadott nyilvántartási időszakra. A paraméter legnagyobb megadható értéke nincs korlátozva."]
["Tervezett bevételi időszak kezdete","2000-01-01","Kitöltött nyilvántartó munkalap esetén információs célokra használható. Ha egy bevétel tervezett időpontja nem esik az itt megadott tervezett bevételi időszakra, a nyilvántartó munkalapon színezett háttérrel jelenik meg a bevétel tervezett dátuma. Tájékozódás után a paraméter visszaállítható egy 2000.01.01-nél nem korábbi dátumra."]
["Tervezett bevételi időszak vége","3000-01-01","Kitöltött nyilvántartó munkalap esetén információs célokra használható. Ha egy bevétel tervezett időpontja nem esik az itt megadott tervezett bevételi időszakra, a nyilvántartó munkalapon színezett háttérrel jelenik meg a bevétel tervezett dátuma. Tájékozódás után a paraméter visszaállítható egy a tervezett bevételi időszak kezdetét követő dátumra."]
{"$rows_left_out":34}
{"sheet":"Mintasor","index":3,"n_rows":55,"n_cols":34,"rows_kept":55,"cut":false,"hidden":true,"merged":[[46,1,46,11],[52,1,52,11],[34,4,34,7],[35,1,35,7],[38,1,38,11],[43,4,43,7],[29,24,29,25],[29,26,30,26],[29,27,29,29],[29,30,30,30],[29,31,29,33],[28,22,28,25],[28,26,28,29],[28,30,28,33],[29,1,30,1],[29,2,30,2],[29,3,29,4],[29,5,30,5],[29,6,30,6],[29,7,30,7],[29,8,29,9],[29,10,29,11],[29,12,30,12],[29,13,29,17],[29,18,29,21],[29,22,30,22],[29,23,30,23],[26,1,26,11],[28,0,30,0],[28,1,28,7],[28,8,28,11],[28,12,28,21],[15,4,15,7],[2,1,2,11],[0,1,0,11],[22,4,22,7],[23,1,23,7],[4,0,6,0],[5,1,6,1],[5,2,6,2],[5,5,6,5],[5,6,6,6],[4,1,4,7],[5,7,6,7],[5,3,5,4],[5,23,6,23],[5,24,5,25],[4,8,4,11],[4,12,4,21],[5,12,6,12],[5,13,5,17],[5,18,5,21],[5,8,5,9],[5,10,5,11],[4,22,4,25],[5,22,6,22],[4,26,4,29],[4,30,4,33],[5,27,5,29],[5,31,5,33],[5,26,6,26],[5,30,6,30]]}
[null,"Nyilvántartó rekordok mintasorai"]
[]
[null,"Az alábbi táblázat azokat a mintasorokat tartalmazza, amelyeket jobb egérgombbal a nyilvántartó munkalapokra másolva bővíthetjük annak sorait. Ezt a munkalapot nem szabad megváltoztatni, bizonyos cellái azonban a beviteli funkciók ellátása miatt nem védettek. Emiatt célszerű a munkalapot rejtett, vagy \"very hidden\" állapotban tartani.\n\nNyilvántartási rekordok prototípusai\nAz \"A\" oszlopban található sortípus jelzés különböző szerepű nyilvántartó rekordokat azonosít:\n\"U\": univerzális prototípus projekt rekord, ebből származtatható az alábbi \"A\", \"T\" és \"B\" típus\n\"A\": szerződés azonosító rekord, a szerződés alapadatait tárolja\n\"T\": tervezett bevételi rekord, a szerződés egy adott időpontra tervezett bevételét rögzíti\n\"B\": bevételi rekord, a felette lévő \"T\" rekordban rögzített tervezett bevétel tényszerű megvalósulását rögzíti\n         (Amennyiben egy tervezett bevétel több részletben érkezik be, ezek további \"B\" rekordokban rögzíthetők.)\n\"S\": szumma, szerződés összegző rekord, a beérkezett bevételek és tartozások összege az adott szerződésre\n\"M\": mindösszesen, az adott szervezeti egység összes szerződésének bevételi és tartozási összege\n(Az \"A\" oszlopban valójában egy kétkarakteres szöveg áll, KARAKTER(160)&\"c\" formátumban, ahol a \"c\" karakter a fenti U, A, T, B, S vagy M betűk egyike.)"]
[]
[{"$f":"CHAR(160)&\"Rekord\"","v":" Rekord"},"Szerződés azonosító adatok",null,null,null,null,null,null,"Bevételek pénzforgalmi adatai",null,null,null,"Rezsi befizetések megvalósulása",null,null,null,null,null,null,null,null,null,"Önrész megelőlegezés a karról",null,null,null,"Tartozások összesen",null,null,null,"Ebből esedékes tartozás"]
[null,"Rövid név","Témavezető","Futamidő",null,"Rezsi halasztás","Téma- szám","Max. rezsi","Tervezett",null,"Tény",null,"Rezsi- szabály","Rezsi összegek megoszlása",null,null,null,null,"Rezsik átadási időpontja",null,null,null,"Előleg összege","Törlesztés határidő","Átadási időpontok",null,"szerződés \na karnak","kar",null,null,"szerződés \na karnak","kar"]
[null,null,null,"kezdete","vége",null,null,null,"összeg","időpont","összeg","időpont",null,"levonható","egyetemi","kari","intézeti","tanszéki","karra","intézetnek","tanszéknek","egyetemnek",null,null,"folyósítás","törlesztés",null,"intézetnek","tanszéknek","egyetemnek",null,"intézetnek","tanszéknek","egyetemnek"]
[{"$f":"CHAR(160)&\"U\"","v":" U"},"Pályázat 01","Gipsz Jakab","2013-01-01","2016-01-01","2015-01-01",12345,0.2,100000000,"2014-01-01",100000000,"2014-01-01","A14",{"$f":"K8*H8","v":20000000},{"$f":"K8*VLOOKUP(M8,INDIRECT(Paraméterek!$B$22),2,FALSE)","v":8000000},{"$f":"K8*VLOOKUP(M8,INDIRECT(Paraméterek!$B$22),3,FALSE)","v":1500000},{"$f":"MIN(K8*VLOOKUP(M8,INDIRECT(Paraméterek!$B$22),4,FALSE),N8-O8-P8)","v":7500000},{"$f":"N8-O8-P8-Q8","v":3000000},"2014-01-01","2014-01-01","2014-01-01","2014-01-01",15000000,"2014-01-01","2014-01-01","2014-01-01",{"$f":"IF(S8<>\"\",0,N8)+IF(AND(Y8<>\"\",Z8=\"\"),W8,0)","v":0},{"$f":"IF(T8<>\"\",0,Q8)","v":0},{"$f":"IF(U8<>\"\",0,R8)","v":0},{"$f":"IF(V8<>\"\",0,O8)","v":0},{"$f":"IF(OR(S8<>\"\",TODAY()<F8),0,N8)+IF(AND(Y8<>\"\",Z8=\"\",TODAY()>=X8),W8,0)","v":0},{"$f":"IF(OR(T8<>\"\",TODAY()<F8),0,IF(Q8<0,Q8,IF(S8<>\"\",Q8,0)))","v":0},{"$f":"IF(OR(U8<>\"\",TODAY()<F8),0,IF(S8<>\"\",R8,0))","v":0},{"$f":"IF(OR(V8<>\"\",TODAY()<F8),0,O8)","v":0}]
[{"$f":"CHAR(160)&\"A\"","v":" A"},"Pályázat 01","Gipsz Jakab","2013-01-01","2016-01-01",null,12345,0.05]
[{"$f":"CHAR(160)&\"T\"","v":" T"},{"$f":"OFFSET(B10,-1,0)","v":"Pályázat 01"},{"$f":"OFFSET(C10,-1,0)","v":"Gipsz Jakab"},"2013-01-01","2016-01-01","00:00:00",12345,0.05,100000000,"2013-01-01"]
{"$rows_left_out":46}
{"sheet":"Mintalap","index":4,"n_rows":12,"n_cols":34,"rows_kept":12,"cut":false,"hidden":true,"merged":[[10,4,10,7],[11,1,11,7],[4,30,4,33],[5,1,6,1],[5,2,6,2],[5,3,5,4],[5,5,6,5],[5,6,6,6],[5,7,6,7],[5,8,5,9],[5,10,5,11],[5,12,6,12],[4,26,4,29],[5,24,5,25],[5,26,6,26],[5,27,5,29],[4,0,6,0],[4,1,4,7],[4,8,4,11],[4,12,4,21],[4,22,4,25],[5,13,5,17],[5,18,5,21],[5,22,6,22],[5,23,6,23],[0,1,0,7],[1,2,1,7],[2,2,2,7],[5,30,6,30],[5,31,5,33]]}
[null,"Szervezeti egység rezsi nyilvántartása"]
[null,"Az egység neve:"]
[null,"MGR kódja:"]
[]
[" Rekord","Szerződés azonosító adatok",null,null,null,null,null,null,"Bevételek pénzforgalmi adatai",null,null,null,"Rezsi befizetések megvalósulása",null,null,null,null,null,null,null,null,null,"Önrész megelőlegezés a karról",null,null,null,"Tartozások összesen",null,null,null,"Ebből esedékes tartozás"]
[null,"Rövid név","Témavezető","Futamidő",null,"Rezsi halasztás","Téma- szám","Max. rezsi","Tervezett",null,"Tény",null,"Rezsi- szabály","Rezsi összegek megoszlása",null,null,null,null,"Rezsik átadási időpontja",null,null,null,"Előleg összege","Törlesztés határidő","Átadási időpontok",null,"szerződés \na karnak","kar",null,null,"szerződés \na karnak","kar"]
[null,null,null,"kezdete","vége",null,null,null,"összeg","időpont","összeg","időpont",null,"levonható","egyetemi","kari","intézeti","tanszéki","karra","intézetnek","tanszéknek","egyetemnek",null,null,"folyósítás","törlesztés",null,"intézetnek","tanszéknek","egyetemnek",null,"intézetnek","tanszéknek","egyetemnek"]
[" A"]
[" T",{"$f":"OFFSET(B9,-1,0)","v":0},{"$f":"OFFSET(C9,-1,0)","v":0},"00:00:00","00:00:00","00:00:00",0,0]
[" B",{"$f":"OFFSET(B10,-1,0)","v":0},0,"00:00:00","00:00:00","00:00:00",0,0,null,null,null,null,null,{"$f":"ROUND(K10*H10,0)","v":0},{"$f":"ROUND(K10*IF(M10=\"\",0,VLOOKUP(M10,INDIRECT(Paraméterek!$B$22),2,FALSE)),0)","v":0},{"$f":"ROUND(K10*IF(M10=\"\",0,VLOOKUP(M10,INDIRECT(Paraméterek!$B$22),3,FALSE)),0)","v":0},{"$f":"ROUND(MIN(K10*IF(M10=\"\",0,VLOOKUP(M10,INDIRECT(Paraméterek!$B$22),4,FALSE)),N10-O10-P10),0)","v":0},{"$f":"N10-O10-P10-Q10","v":0},null,null,null,null,null,null,null,null,{"$f":"IF(S10=\"\",N10,0)+IF(AND(Z10=\"\",Y10<>\"\"),W10,0)","v":0},{"$f":"IF(T10=\"\",Q10,0)","v":0},{"$f":"IF(U10=\"\",R10,0)","v":0},{"$f":"IF(V10=\"\",O10,0)","v":0},{"$f":"IF(AND(S10=\"\",TODAY()>=F10),N10,0)+IF(AND(Z10=\"\",Y10<>\"\",TODAY()>=X10),W10,0)","v":0},{"$f":"IF(OR(AND(Q10>0,T10=\"\",S10<>\"\"),AND(Q10<0,T10=\"\",TODAY()>=F10)),Q10,0)","v":0},{"$f":"IF(AND(U10=\"\",S10<>\"\"),R10,0)","v":0},{"$f":"IF(AND(V10=\"\",TODAY()>=F10),O10,0)","v":0}]
{"$rows_left_out":3}
{"sheet":"MintaÖsszSor","index":5,"n_rows":44,"n_cols":24,"rows_kept":44,"cut":false,"hidden":true,"merged":[[29,1,29,4],[29,5,29,7],[41,1,41,9],[34,1,34,9],[37,1,37,4],[37,5,37,7],[20,1,20,4],[20,5,20,7],[22,1,22,4],[22,5,22,7],[26,1,26,9],[13,1,13,4],[13,5,13,7],[5,14,6,14],[15,1,15,4],[15,5,15,7],[5,16,6,16],[5,17,5,19],[5,20,6,20],[5,21,5,23],[8,1,8,4],[8,5,8,7],[4,16,4,19],[4,20,4,23],[5,1,6,1],[5,2,6,2],[5,3,5,4],[5,5,6,5],[5,6,6,6],[5,7,6,7],[5,8,6,8],[5,9,6,9],[4,10,4,14],[5,10,6,10],[5,11,6,11],[5,12,6,12],[5,13,6,13],[5,15,6,15],[0,1,0,9],[2,1,2,9],[4,0,6,0],[4,1,4,7],[4,8,4,9]]}
[null,"Az összegző munkalap mintasorai"]
[]
[null,"Az alábbi táblázat azokat a mintasorokat tartalmazza, amelyeket a nyilvántartó munkalapokat összesítő makró az \"Összesítés\" munkalapra másol. Ezt a munkalapot nem szabad megváltoztatni, emiatt célszerű a munkalapot rejtett, vagy \"very hidden\" állapotban tartani.\n\nÖsszegző rekordok prototípusai\nAz \"A\" oszlopban található sortípus jelzés különböző szerepű összegző rekordokat azonosít:\n\"N\": névrekord, az összegzésben résztvevő szervezeti egység nevét és MGR kódját tartalmazza\n\"P\": projekt rekord, a szervezeti egység rezsi nyilvántartó lapjának minden szerződéséhez egy ilyen rekord tartozik,\n        az ottani \"A\" és \"S\" rekordok összeszerkesztett változata\n\"M\": mindösszesen, az adott szervezeti egység összes szerződésének bevételi, rezsi és tartozási összegei,\n         a rezsi nyilvántartó lapok \"M\" rekordjának tömörített változata\n\"E\": egyesített összeg rekord, a nyilvántartásban szereplő összes szervezeti egység \"M\" rekordjainak összege\n(Az \"A\" oszlopban valójában egy kétkarakteres szöveg áll, KARAKTER(160)&\"c\" formátumban, ahol a \"c\" karakter a fenti N, P, M vagy E betűk egyike.)"]
[]
[{"$f":"CHAR(160)&\"Rekord\"","v":" Rekord"},"Szerződés azonosító adatok",null,null,null,null,null,null,"Bevételek összesen",null,"Rezsi összegek megoszlása",null,null,null,null,"Önrész","Tartozások összesen",null,null,null,"Ebből esedékes tartozás"]
[null,"Rövid név","Témavezető","Futamidő",null,"Rezsi halasztás","Téma- szám","Max. rezsi","Tervezett","Tény","Levonható","Egyetemi","Kari","Intézeti","Tanszéki","Összes előleg","Szerződés \na karnak","Kar",null,null,"Szerződés \na karnak","Kar"]
[null,null,null,"kezdete","vége",null,null,null,null,null,null,null,null,null,null,null,null,"intézetnek","tanszéknek","egyetemnek",null,"intézetnek","tanszéknek","egyetemnek"]
[]
[{"$f":"CHAR(160)&\"N\"","v":" N"},"TTK Dékán (közös kari kiadások)",null,null,null,"Kód: 332"]
[]
{"$rows_left_out":35}
{"sheet":"MintaÖsszes","index":6,"n_rows":9,"n_cols":24,"rows_kept":9,"cut":false,"hidden":true,"merged":[[8,1,8,4],[8,5,8,7],[5,14,6,14],[5,15,6,15],[5,16,6,16],[5,1,6,1],[5,2,6,2],[5,3,5,4],[5,5,6,5],[5,6,6,6],[5,7,6,7],[5,8,6,8],[5,9,6,9],[5,17,5,19],[5,20,6,20],[5,21,5,23],[4,16,4,19],[4,20,4,23],[1,1,1,7],[2,1,2,7],[4,0,6,0],[4,1,4,7],[4,8,4,9],[4,10,4,14],[5,10,6,10],[5,11,6,11],[5,12,6,12],[5,13,6,13]]}
[]
[null,"Rezsi nyilvántartás"]
[null,"Szervezeti egységek összesítő lapja"]
[]
[" Rekord","Szerződés azonosító adatok",null,null,null,null,null,null,"Bevételek összesen",null,"Rezsi összegek megoszlása",null,null,null,null,"Önrész","Tartozások összesen",null,null,null,"Ebből esedékes tartozás"]
[null,"Rövid név","Témavezető","Futamidő",null,"Rezsi halasztás","Téma- szám","Max. rezsi","Tervezett","Tény","Levonható","Egyetemi","Kari","Intézeti","Tanszéki","Összes előleg","Szerződés \na karnak","Kar",null,null,"Szerződés \na karnak","Kar"]
[null,null,null,"kezdete","vége",null,null,null,null,null,null,null,null,null,null,null,null,"intézetnek","tanszéknek","egyetemnek",null,"intézetnek","tanszéknek","egyetemnek"]
[]
[" E","Szervezeti egységek összesen",null,null,null,null,null,null,{"$f":"SUMIF($A7:INDIRECT(\"$A\"&ROW()-1),CHAR(160)&\"M\",I7:INDIRECT(ADDRESS(ROW()-1,COLUMN())))","v":0},{"$f":"SUMIF($A7:INDIRECT(\"$A\"&ROW()-1),CHAR(160)&\"M\",J7:INDIRECT(ADDRESS(ROW()-1,COLUMN())))","v":0},{"$f":"SUMIF($A7:INDIRECT(\"$A\"&ROW()-1),CHAR(160)&\"M\",K7:INDIRECT(ADDRESS(ROW()-1,COLUMN())))","v":0},{"$f":"SUMIF($A7:INDIRECT(\"$A\"&ROW()-1),CHAR(160)&\"M\",L7:INDIRECT(ADDRESS(ROW()-1,COLUMN())))","v":0},{"$f":"SUMIF($A7:INDIRECT(\"$A\"&ROW()-1),CHAR(160)&\"M\",M7:INDIRECT(ADDRESS(ROW()-1,COLUMN())))","v":0},{"$f":"SUMIF($A7:INDIRECT(\"$A\"&ROW()-1),CHAR(160)&\"M\",N7:INDIRECT(ADDRESS(ROW()-1,COLUMN())))","v":0},{"$f":"SUMIF($A7:INDIRECT(\"$A\"&ROW()-1),CHAR(160)&\"M\",O7:INDIRECT(ADDRESS(ROW()-1,COLUMN())))","v":0},{"$f":"SUMIF($A7:INDIRECT(\"$A\"&ROW()-1),CHAR(160)&\"M\",P7:INDIRECT(ADDRESS(ROW()-1,COLUMN())))","v":0},{"$f":"SUMIF($A7:INDIRECT(\"$A\"&ROW()-1),CHAR(160)&\"M\",Q7:INDIRECT(ADDRESS(ROW()-1,COLUMN())))","v":0},{"$f":"SUMIF($A7:INDIRECT(\"$A\"&ROW()-1),CHAR(160)&\"M\",R7:INDIRECT(ADDRESS(ROW()-1,COLUMN())))","v":0},{"$f":"SUMIF($A7:INDIRECT(\"$A\"&ROW()-1),CHAR(160)&\"M\",S7:INDIRECT(ADDRESS(ROW()-1,COLUMN())))","v":0},{"$f":"SUMIF($A7:INDIRECT(\"$A\"&ROW()-1),CHAR(160)&\"M\",T7:INDIRECT(ADDRESS(ROW()-1,COLUMN())))","v":0},{"$f":"SUMIF($A7:INDIRECT(\"$A\"&ROW()-1),CHAR(160)&\"M\",U7:INDIRECT(ADDRESS(ROW()-1,COLUMN())))","v":0},{"$f":"SUMIF($A7:INDIRECT(\"$A\"&ROW()-1),CHAR(160)&\"M\",V7:INDIRECT(ADDRESS(ROW()-1,COLUMN())))","v":0},{"$f":"SUMIF($A7:INDIRECT(\"$A\"&ROW()-1),CHAR(160)&\"M\",W7:INDIRECT(ADDRESS(ROW()-1,COLUMN())))","v":0},{"$f":"SUMIF($A7:INDIRECT(\"$A\"&ROW()-1),CHAR(160)&\"M\",X7:INDIRECT(ADDRESS(ROW()-1,COLUMN())))","v":0}]